{"text_format":"1","workbook":"xlsx","n_sheets":7,"sheets":["1. Ajuste horas formación","2. Distribución centro+empresa","3. Resumen por periodos"," 4. Coste alumnado","5. Exclusión de bonificaciones","Ciclos Nº RA","Módulos"],"not_rendered":{"charts":0,"images":8,"macros":1,"external_links":0,"defined_names":50,"comments":0,"pivot_tables":0},"unopened":[],"bounds":{"document_bytes":16777216,"sheet_cells":100000,"rows_first":2000,"rows_last":500,"rows_between":2000,"halvings":0,"cell_chars":16384,"cell_head_chars":4096},"cells_cut":0,"cells_raw":0,"read":"whole","date_system":"1900"}

{"sheet":"1. Ajuste horas formación","index":0,"n_rows":47,"n_cols":21,"rows_kept":47,"cut":false,"hidden":false,"merged":[[38,1,38,2],[39,1,39,2],[40,1,40,2],[41,1,41,2],[36,1,36,2],[37,1,37,2],[30,1,30,2],[31,1,31,2],[32,1,32,2],[33,1,33,2],[34,1,34,2],[43,9,44,9],[43,7,44,7],[43,8,44,8],[46,10,46,11],[44,10,44,11],[45,10,45,11],[45,7,45,9],[46,7,46,9],[14,16,14,22],[15,16,15,22],[28,1,28,2],[29,1,29,2],[26,1,27,2],[24,1,24,3],[23,7,23,8],[42,1,42,2],[4,2,4,6],[26,3,26,5],[26,6,26,11],[5,2,5,3],[17,2,17,5],[19,5,19,7],[20,5,20,7],[6,3,6,6],[16,2,16,8],[11,1,11,3],[12,1,12,3],[6,1,6,2],[11,6,11,9],[12,6,12,9],[35,1,35,2]]}
[]
[null,"Organización Proyectos FP Dual Intensiva Grados D"]
[null,null,null,null,null,null,"Curso académico ","2025 / 2026"]
[null,null,null,null,null,null,null,null,null,"Criterio de colores de celdas"]
[null,"CENTRO FORMATIVO:","IES Ejemplo de Centro",null,null,null,null,null,null,null,"Deben rellenarse sus datos"]
[null,"CÓDIGO DEL CICLO FORMATIVO:","ADG201 (LFP)",null,null,null,null,null,null,null,"Son resultados de cálculo",null,null,null,null,"Dualizado","Coexiste formación en centro educativo con jornada trabajo en misma semana",null,null,"NO","Contrato formación en alternancia"]
[null,"TÍTULO FP VINCULADO AL PROYECTO:",null,{"$f":"VLOOKUP(C6,Módulos!A$2:B$3000,2,FALSE)","v":"Gestión Administrativa"},null,null,null,null,null,null,null,null,null,null,null,"No dualizado","Semanas alternas formación en centro y laborales, no coexiste formación centro y trabajo en misma semana",null,null,"SI","Beca formación"]
[]
[]
[null,"Información horas máximas a realizar en empresa y RA mínimos a dualizar"]
[null,null,null,null,null,null,null,null,null,null,null,null,null,null,null,{"$f":"1000/30","v":33.333333333333336}]
[null,{"$f":"IF(C6<>\"TMV302 (LFP)\",\"Nº horas realizadas en 1º curso en Dual General en empresa\",\"Nº horas realizadas en 2º curso en Dual General en empresa\")","v":"Nº horas realizadas en 1º curso en Dual General en empresa"},null,null,140,null,{"$f":"IF(C6<>\"TMV302 (LFP)\",\"Nº RA realizados en 1º curso\",\"Nº RA realizados en 2º curso\")","v":"Nº RA realizados en 1º curso"},null,null,null,5,null,null,null,null,{"$f":"IF(J21=\"SI\",Mod_sem_min_1año,Sem_min_1año)","v":0},null,700]
[null,{"$f":"IF(C6<>\"TMV302 (LFP)\",\"Nº máximo de horas a realizar en empresa en 2º curso en Dual Intensiva\",\"Nº máximo horas a realizar en empresa en 3º curso en Dual Intensiva\")","v":"Nº máximo de horas a realizar en empresa en 2º curso en Dual Intensiva"},null,null,{"$f":"IF(C6<>\"TMV302 (LFP)\",Max_horas_en_empresa_en_total-E12,0.5*2762-E12)","v":860},null,{"$f":"IF(C6<>\"TMV302 (LFP)\",\"Nº RA mínimo a realizar en 2º curso\",\"Nº RA mínimo a realizar en 3º curso\")","v":"Nº RA mínimo a realizar en 2º curso"},null,null,null,{"$f":"ROUND(IF(C6=\"\",\"\",VLOOKUP(C6,'Ciclos Nº RA'!B4:F122,5,FALSE))*P18-K12,0)","v":19},null,null,null,null,{"$f":"IF(ROUNDUP(MAX(J29:J43),0)>Semanas_max_en_2,Semanas_max_en_2,ROUNDUP(MAX(J29:J43),0))","v":0},null,20,"(horas máximas / semana coexistencia formación empresa - trabajo por Resolución Proyecto)"]
[null,null,null,null,null,null,null,null,null,null,null,null,null,null,null,{"$f":"IF(Tipo_relación_laboral=\"Beca formación\",F44/I22,0.35)","v":0.35},{"$f":"ROUND(P14*100,0)","v":35}]
[null,"Información modelo alternancia y datos de la relación laboral",null,null,null,null,null,null,null,null,null,null,null,null,null,1000,"nº máximo horas a en empresa entre 1º y 2º curso"]
[null,null,null,null,null,null,null,null,null,null,null,null,null,null,null,700,"nº mínimo horas a en empresa entre 2º curso"]
[null,"Tipo proyecto modelo de alternancia","Semanas alternas formación en centro y laborales, no coexiste formación centro y trabajo en misma semana"]
[null,"Tipo de relación laboral","Contrato formación en alternancia",null,null,null,null,null,null,null,null,null,null,null,null,0.3,"Nº RA mínimos en empresa"]
[null,null,null,null,null,null,null,null,null,null,"Nº horas máximas docencia/semana ",null,null,null,null,0.35,"%  Mínimo horas de formación en centro"]
[null,"Horas convenio en empresa ",1780,null,null,"Días contrato ",null,null,{"$f":"C22-C21+1","v":281},null,{"$f":"IF(C17=$Q$6,R13,30)","v":30}]
{"$rows_left_out":28}
{"sheet":"2. Distribución centro+empresa","index":1,"n_rows":106,"n_cols":33,"rows_kept":106,"cut":false,"hidden":false,"merged":[[14,20,15,28],[21,11,21,12],[22,11,22,12],[20,5,20,6],[20,7,20,8],[21,5,21,6],[21,7,21,8],[22,5,22,6],[22,7,22,8],[19,7,19,8],[18,5,18,8],[19,5,19,6],[54,10,54,16],[54,18,54,24],[54,26,54,32],[54,2,54,8],[89,18,89,24],[89,26,89,32],[71,2,71,8],[80,2,80,8],[71,10,71,16],[71,18,71,24],[71,26,71,32],[80,10,80,16],[80,18,80,24],[80,26,80,32],[98,2,98,8],[98,10,98,16],[98,18,98,24],[98,26,98,32],[89,2,89,8],[89,10,89,16],[48,38,49,39],[27,2,27,8],[27,10,27,16],[27,18,27,24],[27,26,27,32],[30,38,30,39],[31,38,32,38],[31,39,32,39],[45,18,45,24],[45,26,45,32],[36,2,36,8],[36,10,36,16],[36,18,36,24],[36,26,36,32],[45,2,45,8],[45,10,45,16],[1,21,1,22],[1,24,1,25],[8,6,8,8],[7,18,7,19],[3,4,3,12],[5,4,5,17],[4,4,4,6],[7,6,7,8],[8,18,8,19],[8,21,11,32],[9,18,9,19],[10,18,10,19],[11,18,11,19],[24,11,24,12],[20,9,20,10],[24,13,24,14],[24,1,25,10],[20,13,20,14],[21,13,21,14],[22,13,22,14],[25,11,25,14],[23,5,23,6],[23,7,23,8],[23,9,23,10],[23,11,23,12],[23,13,23,14],[12,9,12,10],[21,9,21,10],[20,11,20,12],[22,9,22,10],[18,11,18,14],[19,11,19,12],[18,9,19,10],[19,13,19,14]]}
[]
[null,null,"Calendario FP-DUAL Intensiva",null,null,null,null,null,null,null,null,null,null,null,null,null,null,null,null,null,"Año académico:     ",{"$f":"MID('1. Ajuste horas formación'!H3,1,4)","v":"2025"},null," /",{"$f":"AñoActual+1","v":2026}]
[]
[null,null,"Centro",null,{"$f":"IF('1. Ajuste horas formación'!C5=\"\",\"\",'1. Ajuste horas formación'!C5)","v":"IES Ejemplo de Centro"}]
[null,null,"Ciclo",null,{"$f":"IF('1. Ajuste horas formación'!C6=\"\",\"\",'1. Ajuste horas formación'!C6)","v":"ADG201 (LFP)"}]
[null,null,"Ciclo",null,{"$f":"IF('1. Ajuste horas formación'!D7=\"\",\"\",'1. Ajuste horas formación'!D7)","v":"Gestión Administrativa"}]
[]
[null,null,"Inicio contrato",null,null,null,{"$f":"'1. Ajuste horas formación'!C21","v":"2025-09-12"},null,null,null,null,"Horas máximas contrato",null,null,null,null,null,null,{"$f":"'1. Ajuste horas formación'!I22","v":1370},null,"(horas en centro + horas en empresa)"]
[null,null,"Fin de contrato",null,null,null,{"$f":"'1. Ajuste horas formación'!C22","v":"2026-06-19"},null,null,null,null,"Horas minimas centro educativo",null,null,null,null,null,null,{"$f":"'1. Ajuste horas formación'!K44","v":0},null,null,"Depedende del proyecto a veces no se alcanza las horas máximas de contrato, pero deben cumplirse la mínimas en centro educativo y las de empresa situarse entre su mínimo y máximo, siendo su suma inferior a las máximas de contrato."]
[null,null,null,null,null,null,null,null,null,null,null,"Horas máximas en empresa",null,null,null,null,null,null,{"$f":"'1. Ajuste horas formación'!E13","v":860}]
[null,null,null,null,null,null,null,null,null,null,null,"Horas mínimas en empresa",null,null,null,null,null,null,{"$f":"'1. Ajuste horas formación'!P16","v":700}]
[null,null,null,null,null,null,null,null,null,null,null,"Días vacaciones",null,null,null,null,null,null,{"$f":"ROUND('1. Ajuste horas formación'!I21,0)","v":17}]
[null,null,"Tipos de días"]
[null,null,null,"Marcar los días con los colores según el tipo de día en el calendario"]
[null,null,null,null,null,"Nº días",null,null,null,null,null,null,null,null,null,null,null,null,null,null,"Festivos adicionales no incluidos inicialmente en el calendario para  2025/2026:"]
[null,null,"Festivos",null,null,{"$f":"COUNTIF($C$74:$AG$106,ObtenerColorCelda(E16))","v":24}]
[null,null,"Vacaciones",null,null,{"$f":"COUNTIF($C$74:$AG$106,ObtenerColorCelda(E17))","v":0},{"$f":"IF(F17<Dias_vacaciones,CONCATENATE(\"Incluir \",Dias_vacaciones,\" días de vacaciones\"),\"Ajustadas vacaciones\")","v":"Incluir 17 días de vacaciones"},null,null,null,null,null,null,null,null,null,null,null,null,null,null,"Provinciales"]
[null,null,null,null,null,null,null,null,null,null,null,null,null,null,null,null,null,null,null,null,null,null,"Huesca: 12 y 13 de febrero"]
[null,null,null,null,null,"Nº horas/día en",null,null,null,"Nº días según tipo",null,"Nº horas en",null,null,null,null,null,null,null,null,null,null,"Teruel: 20 y 23 de febrero"]
[null,null,null,null,null,"Centro",null,"Empresa",null,null,null,"Centro",null,"Empresa",null,null,null,null,null,null,null,null,"Zaragoza: 10 de octubre y 6 de marzo"]
{"$rows_left_out":87}
{"sheet":"3. Resumen por periodos","index":2,"n_rows":15,"n_cols":8,"rows_kept":15,"cut":false,"hidden":false,"merged":[[12,6,13,6],[0,3,1,3],[0,5,1,5],[12,7,13,7],[14,2,17,5],[14,6,17,7],[0,6,1,6],[0,7,1,7],[12,5,13,5],[0,0,1,0],[0,1,1,1],[0,2,1,2],[0,4,1,4],[12,2,13,2],[12,3,13,3],[12,0,13,0],[12,1,13,1],[12,4,13,4]]}
["PERIODO (Insertar un nuevo periodo cada vez que haya un cambio en el horario o la distribución de jornada. Completar únicamente desde la fecha de firma de contrato o beca)","Fechas del periodo\n\n(Ejemplo: De 12/09/2025 a 20/12/2025)","Horas semanales de formación en el centro (completar únicamente desde la fecha de firma de contrato o beca con número de periodos lectivos)*\n\n(Ejemplo: 20)","Horas totales en el PERIODO de formación en el centro (completar únicamente desde la fecha de firma de contrato o beca con número de periodos lectivos)\n\n(Ejemplo: 120)","Horas semanales de trabajo efectivo en la empresa*\n\n(Ejemplo: 10)","Horas en el PERIODO de trabajo efectivo en la empresa\n\n(Ejemplo: 60)","Distribución horario en el centro educativo\n\n(Ejemplo: De L a V de 8:30 a 14:30)","Horario laboral en la empresa\n\n(Ejemplo: De L a V de 16:00 a 18:00)"]
[]
["PERIODO 1"]
["PERIODO 2"]
["PERIODO 3"]
["PERIODO 4"]
["PERIODO 5"]
["PERIODO 6"]
["PERIODO 7"]
["PERIODO 8"]
["PERIODO 9"]
["PERIODO 10"]
["Horas jornada máxima anual según convenio colectivo aplicable:",{"$f":"'1. Ajuste horas formación'!I22","v":1370},"Horas de formación en Centro Educativo:",{"$f":"SUM(D3:D12)","v":0},"Horas de trabajo efectivo en empresa:",{"$f":"SUM(F3:F12)","v":0},"Horas totales contrato",{"$f":"ROUND((D13+F13),0)","v":0}]
[]
[null,null,{"$f":"CONCATENATE(\"(1) El porcentaje de las horas de formación en el centro debe ser de un \",'1. Ajuste horas formación'!Q14,\"%\")","v":"(1) El porcentaje de las horas de formación en el centro debe ser de un 35%"},null,null,null,"(2) La suma total de horas (centro educativo y empresa) debe ser como máximo la del periodo del contrato del convenio colectivo aplicable."]

{"sheet":" 4. Coste alumnado","index":3,"n_rows":32,"n_cols":14,"rows_kept":32,"cut":false,"hidden":false,"merged":[[31,7,31,8],[25,7,25,8],[27,7,28,7],[27,8,28,8],[29,2,29,6],[29,7,30,7],[29,8,30,8],[30,2,30,6],[7,7,7,8],[8,0,9,2],[8,7,8,8],[10,7,10,8],[21,3,22,3],[21,4,22,4],[21,5,22,5],[21,6,22,6],[21,7,22,7],[21,8,22,8],[2,9,2,11],[2,12,2,13],[4,7,4,8],[5,7,6,8],[5,9,6,9],[5,10,6,10],[5,11,6,11],[5,12,6,12],[5,13,6,13]]}
["Coste para la empresa del alumnado (2025)",null,null,null,null,null,null,"Cotizaciones contrato formación en alternancia (2025) - (Orden PJC/178/2025, de 25 febrero de 2025)"]
[]
[null,"Salario mínimo interprofesional (2025)",null,null,null,null,null,null,null,"Contrato en alternancia",null,null,"Beca de formación"]
[null,null,"SMI (€/año)",16576,null,null,null,null,null,"Empresa","Trabajador","Total","Empresa","Trabajador"]
[null,null,"SMI (€/mes)",{"$f":"D4/12","v":1381.3333333333333},"(12 pagas)",null,null,"Contingencias comunes",null,55.97,11.16,{"$f":"J5+K5","v":67.13},63.44]
[null,null,null,null,null,null,null,"Accidentes de trabajo y enfermedades profesionales",null,7.71,null,{"$f":"J6+K6","v":7.71},7.71]
[]
[null,"Cálculo medio mensual pago y cotizaciones",null,null,null,null,null,"Desempleo",null,75.97,21.41,97.38]
["% formación mínima en centro educativo",null,null,0.35,null,null,null,"Formación",null,2.09,0.27,2.36]
[null,null,null,null,null,null,null,"Fondo garancia salarial",null,4.25,null,{"$f":"J10+K10","v":4.25}]
[null,null,null,null,null,null,null,"MEI (no se puede bonificar)",null,9.25,1.8,{"$f":"J11+K11","v":11.05}]
[null,null,null,null,null,null,null,null,null,{"$f":"SUM(J5:J11)","v":155.24},{"$f":"SUM(K5:K11)","v":34.64},189.88,71.149999999999991,0]
[]
[null,null,null,null,null,null,null,null,"Bonificaciones contrato en alternancia","Empresa","Trabajador","Total"]
[null,null,null,null,null,null,null,null,"Bonificaciones (RD Ley 1/2023)",91,28,{"$f":"J15+K15","v":119}]
[null,null,null,null,null,null,null,null,"Tutorización más de 5 trabajadores",60]
[null,null,null,null,null,null,null,null,"Tutorización igual o menos de 5 trabajadores",80]
[]
[null,null,null,null,null,null,null,null,"Bonificaciones beca de formación",0.95,"(de contigencias comunes)"]
[]
{"$rows_left_out":13}
{"sheet":"5. Exclusión de bonificaciones","index":4,"n_rows":4,"n_cols":3,"rows_kept":4,"cut":false,"hidden":false,"merged":[]}
[]
[null,"Exclusiones de bonificación / reducción de cuotas SS "]
[]
[null,null,"Acceso al último documento de Beneficios en la Cotización de la Seguridad Social"]

{"sheet":"Ciclos Nº RA","index":5,"n_rows":122,"n_cols":22,"rows_kept":122,"cut":false,"hidden":true,"merged":[[1,3,1,5],[1,6,1,8]]}
[null,"Ciclos de GM implantados en Aragón",null,null,null,"% RA-->",0.2,null,"% formación en 1º-->",null,0.28000000000000003]
[null,null,null,"Nº resultados de aprendizaje (RA)",null,null,"Propuesta RA por curso en % horas estancia formación"]
[null,"Código ciclos","Ciclo","1º","2º","1º + 2º","RA máx (1º+2º)","1º","2º",null,"1º","2º","3º","4º","5º","6º","7º","8º","9º","10º","11º","12º"]
[1,"ADG201 (LFP)","Gestión Administrativa",48,32,80,16,4,12,null,"0442 - Operaciones Administrativas de Recursos Humanos","0443 - Tratamiento de la Documentación Contable","0446 - Empresa en el aula","0448 - Operaciones Auxiliares de Gestión de Tesorería","1708 - Sostenibilidad aplicada al sistema productivo","1710 - Itinerario personal para la empleabilidad II"]
[2,"ADG301 (LFP)","Administración y finanzas",49,42,91,18,5,13,null,"0652 - Gestión de recursos humanos","0653 - Gestión financiera","0654 - Contabilidad y fiscalidad","0655 - Gestión logística y comercial","0656 - Simulación empresarial","0657 - Proyecto intermodular de administración y finanzas","1710 - Itinerario personal para la empleabilidad II","1708 - Sostenibilidad aplicada al sistema productivo"]
[3,"ADG302 (LFP)","Asistencia a la dirección",49,36,85,17,5,12,null,"0180 - Segunda lengua extranjera","0661 - Protocolo empresarial","0662 - Organización de eventos empresariales","0663 - Gestión avanzada de la información","0664 - Proyecto intermodular de asistencia a la dirección","1710 - Itinerario personal para la empleabilidad II","1708 - Sostenibilidad aplicada al sistema productivo"]
[4,"AFD201 (LFP)","Guía en el medio natural y de tiempo libre",50,42,92,18,5,13,null,"1327 -  Guía ecuestre","1335 -  Técnicas de tiempo libre","1337 -  Socorrismo en el medio natural","1338 -  Guía en el medio natural acuático","1339 -  Maniobras con cuerdas","1708 - Sostenibilidad aplicada al sistema productivo","1710 - Itinerario personal para la empleabilidad II"]
[5,"AFD301 (LFP)","Enseñanza y animación sociodeportiva",48,38,86,17,5,12,null,"1123 - Actividades de ocio y tiempo libre","1137 - Planificación de la animación sociodeportiva","1140 - Actividades físico-deportivas de equipo","1141 - Actividades físico-deportivas de implementos","1142 - Actividades físico-deportivas para la inclusión social","1144 - Proyecto intermodular de enseñanza y animación\nsociodeportiva\nfísicodeportivas","1710 - Itinerario personal para la empleabilidad II","1708 - Sostenibilidad aplicada al sistema productivo"]
[6,"AFD302 (LFP)","Acondicionamiento físico",46,32,78,15,4,11,null,"1148 - Fitness en sala de entrenamiento polivalente","1150 - Actividades especializadas de acondicionamiento físico con soporte musical","1151 - Acondicionamiento físico en el agua","1154 - Proyecto intermodular de acondicionamiento físico","1710 - Itinerario personal para la empleabilidad II","1708 - Sostenibilidad aplicada al sistema productivo"]
[7,"AGA201 (LFP)","Producción agropecuaria",43,40,83,16,4,12,null,"0477 - Producción de Leche, Huevos y Animales para Vida","0478 - Producción de Carne y otras Producciones Ganaderas","0479 - Control Fitosanitario","0408 - Infraestructuras e Instalaciones Agrícolas","0475 - Implantación de Cultivos","1708 - Sostenibilidad aplicada al sistema productivo","1710 - Itinerario personal para la empleabilidad II"]
[8,"AGA202 (LFP)","Producción agroecológica",43,43,86,17,5,12,null,"0408 - Infraestructuras e instalaciones agrícolas","0410 - Producción vegetal ecológica","0411 - Producción ganadera ecológica","0412 - Manejo sanitario del agrosistema","0413 - Comercialización de productos agroecológicos","1708 - Sostenibilidad aplicada al sistema productivo","1710 - Itinerario personal para la empleabilidad II"]
[9,"AGA204 (LFP)","Jardinería y floristería",42,44,86,17,5,12,null,"0408 - Infraestructuras e instalaciones agrícolas","0479 - Control fitosanitario","0578 - Producción de plantas y tepes en vivero","0579 - Composiciones florales y con plantas","0580 - Establecimientos de floristería","0581 - Técnicas de venta en jardinería y floristería","1708 - Sostenibilidad aplicada al sistema productivo","1710 - Itinerario personal para la empleabilidad II"]
[10,"AGA205 (LFP)","Aprovechamiento del medio natural",44,42,86,17,5,12,null,"0479 - Control fitosanitario","0833 - Aprovechamiento del medio natural","0834 - Conservación de las especies cinegéticas y piscícolas","0835 - Producción de planta forestal en vivero","0838 - Uso público en espacios naturales","1708 - Sostenibilidad aplicada al sistema productivo","1710 - Itinerario personal para la empleabilidad II"]
[11,"AGA302 (LFP)","Gestión forestal y del medio natural",51,47,98,19,5,14,null,"0692 - Fitopatología","0790 - Técnicas de educación ambiental","0810 - Gestión de los aprovechamientos del medio forestal","0812 - Gestión cinegética","0813 - Gestión de la pesca continental","0816 - Defensa contra incendios forestales","0817 - Proyecto intermodular de gestión forestal y conservación del medio","1710 - Itinerario personal para la empleabilidad II","1708 - Sostenibilidad aplicada al sistema productivo"]
[12,"AGA303 (LFP)","Paisajismo y medio rural",48,37,85,17,5,12,null,"0692 - Fitopatología","0696 - Gestión de cultivos","0697 - Diseño de jardines y restauración del paisaje","0698 - Conservación de jardines y céspedes deportivos","0699 -  Proyecto intermodular de paisajismo y medio rural","1710 - Itinerario personal para la empleabilidad II","1708 - Sostenibilidad aplicada al sistema productivo"]
[13,"AGA304 (LFP)","Ganadería y asistencia en sanidad animal",39,41,80,16,4,12,null,"1276 - Gestión de la recría de caballos","1277 - Organización y supervisión de la doma y manejo de équidos","1279 - Saneamiento ganadero","1280 - Asistencia a la atención veterinaria","1281 - Bioseguridad","1283 - Proyecto intermodal de ganadería y asistencia en sanidad animal","1710 - Itinerario personal para la empleabilidad II","1708 - Sostenibilidad aplicada al sistema productivo"]
[14,"ARG202 (LFP)","Impresión gráfica",36,37,73,14,4,10,null,"0869 - Impresión digital","0878 - Desarrollo de la tirada offset","0879 - Impresión en flexografía","0883 - Impresión en bajorrelieve","1708 - Sostenibilidad aplicada al sistema productivo","1710 - Itinerario personal para la empleabilidad II"]
[15,"ARG203 (LFP)","Preimpresión digital",39,38,77,15,4,11,null,"0868 - Imposición y obtención digital de la forma impresora","0869 - Impresión digital","0870 - Compaginación","0872 - Ensamblado de publicaciones electrónicas","1708 - Sostenibilidad aplicada al sistema productivo","1710 - Itinerario personal para la empleabilidad II"]
[16,"ARG301 (LFP)","Diseño y edición de publicaciones impresas y multimedia",40,39,79,15,4,11,null,"1481 - Gestión de la producción en procesos de edición","1482 - Producción editorial","1483 - Diseño estructural de envase y embalaje","1484 - Diseño y planificación de proyectos editoriales multimedia","1485 - Desarrollo y publicación de productos editoriales multimedia","1486 - Proyecto intermodular de diseño y edición de publicaciones impresas y multimedia","1710 - Itinerario personal para la empleabilidad II","1708 - Sostenibilidad aplicada al sistema productivo"]
[17,"ARG302 (LFP)","Diseño y gestión de la producción gráfica",40,42,82,16,4,12,null,"1538 -  Gestión de la producción en la industria gráfica","1539 -  Gestión del color","1540 -  Organización de los procesos de impresión gráfica","1541 -  Organización de los procesos de postimpresión, transformados y acabados","1542 -  Proyecto de diseño y gestión de la producción gráfica","1710 - Itinerario personal para la empleabilidad II","1708 - Sostenibilidad aplicada al sistema productivo"]
{"$rows_left_out":103}
{"sheet":"Módulos","index":6,"n_rows":2502,"n_cols":8,"rows_kept":2502,"cut":false,"hidden":true,"merged":[]}
["Código Ciclo","Ciclo Formativo","Código Módulo","Módulo",null,"Curso","Horas Semanales","Horas Totales"]
["ADG201 (LFP)","Gestión Administrativa","0156","Inglés Profesional (GM)",{"$f":"CONCATENATE(A2,\" - \",C2)","v":"ADG201 (LFP) - 0156"},1,2,67]
["ADG201 (LFP)","Gestión Administrativa","0437","Comunicación empresarial y atención al cliente",{"$f":"CONCATENATE(A3,\" - \",C3)","v":"ADG201 (LFP) - 0437"},1,4,133]
["ADG201 (LFP)","Gestión Administrativa","0438","Operaciones administrativas de compra-venta","ADG201 (LFP) - 0438",1,4,133]
["ADG201 (LFP)","Gestión Administrativa","0439","Empresa y Administración","ADG201 (LFP) - 0439",1,4,133]
["ADG201 (LFP)","Gestión Administrativa","0440","Tratamiento informático de la información","ADG201 (LFP) - 0440",1,7,233]
["ADG201 (LFP)","Gestión Administrativa","0441","Técnica Contable","ADG201 (LFP) - 0441",1,4,133]
["ADG201 (LFP)","Gestión Administrativa","1664","Digitalización aplicada a los sectores productivos (GM)","ADG201 (LFP) - 1664",1,1,33]
["ADG201 (LFP)","Gestión Administrativa","1709","Itinerario personal para la empleabilidad I","ADG201 (LFP) - 1709",1,3,100]
["ADG201 (LFP)","Gestión Administrativa","A997","Tutoría I","ADG201 (LFP) - A997",1,1,33]
["ADG201 (LFP)","Gestión Administrativa","0442","Operaciones Administrativas de Recursos Humanos","ADG201 (LFP) - 0442",2,5,167]
["ADG201 (LFP)","Gestión Administrativa","0443","Tratamiento de la Documentación Contable","ADG201 (LFP) - 0443",2,5,167]
["ADG201 (LFP)","Gestión Administrativa","0446","Empresa en el aula","ADG201 (LFP) - 0446",2,6,200]
["ADG201 (LFP)","Gestión Administrativa","0448","Operaciones Auxiliares de Gestión de Tesorería","ADG201 (LFP) - 0448",2,5,167]
["ADG201 (LFP)","Gestión Administrativa","1708","Sostenibilidad aplicada al sistema productivo","ADG201 (LFP) - 1708",2,1,33]
["ADG201 (LFP)","Gestión Administrativa","1710","Itinerario personal para la empleabilidad II","ADG201 (LFP) - 1710",2,2,67]
["ADG201 (LFP)","Gestión Administrativa","1713","Proyecto Intermodular","ADG201 (LFP) - 1713",2,2,67]
["ADG201 (LFP)","Gestión Administrativa","A996","Tutoría II","ADG201 (LFP) - A996",2,1,33]
["ADG201 (LFP)","Gestión Administrativa","0OPT","Módulo profesional optativo","ADG201 (LFP) - 0OPT",2,3,100]
["ADG301 (LFP)","Administración y Finanzas","0179","Inglés Profesional (GS)","ADG301 (LFP) - 0179",1,2,67]
{"$rows_left_out":2482}